Anthroposophy
type: Concept
scope note: Philosophy of a holistic world view and holistic concept of life and health developed by R. Steiner, based on elements of pantheism, Goethe’s morphology, and different world religions. Applied in various fields such as agriculture, medicine and healing, architecture, arts, education (Waldorf education and Montessori method).
scope note: Philosophische Lehre von R. Steiner, die auf ein ganzheitliches Welt- und Menschenbild und eine ganzheitliche Vorstellung von Leben und Gesundheit abzielt und die Elemente des Pantheismus, der Morphologie Goethes sowie verschiedener Weltreligionen enthält; sie findet in unterschiedlichen Praxisfeldern (Landwirtschaft, Medizin und Heilkunde, Architektur, bildende Kunst, Waldorf- und Montessori-Pädagogik) Anwendung. @de
top concept of: Additional Terms (IT)
in scheme: Additional Terms (IT)
preferred label: Anthroposophie @de

Theories
type: Collection
preferred label: Theorien @de
member: Anthroposophy

Additional Terms (IT)
type: ConceptScheme
preferred label: Zusatzdeskriptoren (IT) @de
has top concept: Anthroposophy