Alternativkultur
type: Concept
editorial note: TTR:hier ist kein englischer Begriff hinterlegt, obwohl es meiner Meinung nach einen gibt: _alternative culture_. Auch könnten _Gegenkultur_ und engl. _counter culture_ und _counterculture_ als Synonyme hinterlegt werden - die GND macht das auch bei ihren Schlagwörten, siehe mit 'closeMatch' gemappter DNB-Begriff.
scope note: Alternative values and alternative ways of living regarding family relations, housing, ecology, education, health services and counseling, supervision, economy, social movements. @en
scope note: Von den üblichen Mustern bewusst abweichende Lebensformen und Wertvorstellungen in den verschiedensten Bereichen, beispielsweise in Familie, Wohnen, Ökologie, Erziehung, Gesundheitsarbeit und Beratung, Supervision, Wirtschaft und sozialen Bewegungen.
top concept of: Zusatzdeskriptoren (IT)
in scheme: Zusatzdeskriptoren (IT)

Politik, Gesellschaft, Arbeit
type: Collection
preferred label: Politics, Society, Work @en
member: Alternativkultur

Zusatzdeskriptoren (IT)
type: ConceptScheme
preferred label: Additional Terms (IT) @en
has top concept: Alternativkultur