Action Theories
type: Concept
scope note: System of concepts and basic theoretical assumptions for the analysis and explanation of goal-directed intentional actions. Theories of action focus on structural aspects of actions such as situations or on processual or organizational aspects of actions such as the concept of action regulation.
scope note: Ein System von Begriffen und fundamentalen theoretischen Annahmen, das zur Analyse und Erklärung von zielgerichteten, intentionalen Handlungen verwendet wird; Handlungstheorien beschäftigen sich teilweise mit den strukturellen Voraussetzungen von Handlungen, etwa mit situationalen, teilweise mit dem Prozess bzw. dem organisierten Ablauf von Handlungen, etwa der Handlungsregulation. @de
top concept of: Additional Terms (IT)
in scheme: Additional Terms (IT)
preferred label: Handlungstheorien @de

Theories
type: Collection
preferred label: Theorien @de
member: Action Theories

Additional Terms (IT)
type: ConceptScheme
preferred label: Zusatzdeskriptoren (IT) @de
has top concept: Action Theories