Action and State Orientation
type: Concept
scope note: Personality and motivation psychology concept by J. Kuhl focusing on the individual tendency to analyze a given situation vs the impulse to act, mainly in situations associated with success vs failure.
scope note: Persönlichkeits- und motivations-psychologisches Konzept von J. Kuhl, das sich auf die individuelle Tendenz bezieht, vor allem in erfolgs- versus misserfolgsassoziierten Situationen die Analyse des gegebenen Zustands versus die Ausführung einer Handlungstendenz zu bevorzugen. @de
top concept of: Additional Terms (IT)
in scheme: Additional Terms (IT)
preferred label: Handlungs- und Lageorientierung @de

Personality and Social Psychology
type: Collection
preferred label: Persönlichkeits- und Sozialpsychologie @de
member: Action and State Orientation

Additional Terms (IT)
type: ConceptScheme
preferred label: Zusatzdeskriptoren (IT) @de
has top concept: Action and State Orientation