Additional Terms (IT)
type: ConceptScheme
preferred label: Zusatzdeskriptoren (IT) @de

Methodology
type: Collection
member: Test Theory
preferred label: Methodik @de

Test Theory
type: Concept
created: 1979-01-01
is replaced by: https://w3id.org/zpid/vocabs/terms/09335
is replaced by: https://w3id.org/zpid/vocabs/terms/26825
modified: 2021-01-01
deprecated: true
broad match: https://w3id.org/zpid/vocabs/terms/09335
broad match: https://w3id.org/zpid/vocabs/terms/26825
broader: https://w3id.org/zpid/vocabs/terms/09335
broader: https://w3id.org/zpid/vocabs/terms/26825
history note: Bis 2021; IT wurde deaktiviert, da im Thesaurus jetzt die CTs Classical Test Theory und Item Response Theory zur Verfügung stehen. Allerdings wurde der IT nicht in den Records ersetzt (es sind also noch ältere Nachweise mit IT=Test Theory verschlagwortet, aber für neue wird er nicht mehr verwendet), da nicht entschieden werden konnte, ob der IT durch den CT Classical Test Theory oder den CT Item Response Theorie ersetzt werden soll.
in scheme: Additional Terms (IT)
preferred label: Testtheorie @de
scope note: Theoretical foundations underlying the construction and analysis of psychological tests.
scope note: Die theoretischen Voraussetzungen der Konstruktion und Analyse psychologischer Tests. @de