Additional Terms (IT)
type: ConceptScheme
has top concept: Kurpatientinnen und -patienten
preferred label: Zusatzdeskriptoren (IT) @de

Clinical Psychology
type: Collection
member: Kurpatientinnen und -patienten
preferred label: Klinische Psychologie @de

Kurpatientinnen und -patienten
type: Concept
modified: 2023-03-08
broad match: concept_10050351
broader: concept_10050351
editorial note: TTR: Hier gibt es kein englisches Wort. Ich habe stattdessen das deutsche im englischen Preflabel eingesetzt. @de
editorial note: Übersetzungsvorschlag von KT: Medical Spa Patients
history note: Changed German wording for appropriate gendering in prefLabel and scopeNote in early 2023
in scheme: Additional Terms (IT)
scope note: Patients undergoing adjunctive time-limited inpatient treatment in specialized hospitals or health resorts for secondary and tertiary prevention.
scope note: Patientinnen und Patienten, die sich aus Gründen der sekundären und tertiären Prävention einer zeitlich begrenzten stationären Behandlung in spezifischen Fachkliniken unterziehen. @de
top concept of: Additional Terms (IT)