Additional Terms (IT)
type: ConceptScheme
has top concept: Holistic Psychology
preferred label: Zusatzdeskriptoren (IT) @de

Holistic Psychology
type: Concept
in scheme: Additional Terms (IT)
preferred label: Ganzheitspsychologie @de
scope note: School of psychology developed in Germany in the first decades of the 20th century which focuses on the concept of wholeness and holistic aspects of psychological phenomena and which had a strong influence on the development of Gestalt theory. Used for this historical school and/or the topic of 'Ganzheit' (wholeness).
scope note: Eine zu Beginn des 20. Jahrhunderts in Deutschland entwickelte psychologiegeschichtliche Schule, die die Notwendigkeit einer ganzheitlichen Betrachtung psychischer Phänomene besonders nachdrücklich betonte; beeinflusste die Entwicklung der Gestalttheorie maßgeblich; wird indexiert zur Bezeichnung dieser historischen Schule sowie dann, wenn das Ganzheitskonzept eine zentrale Rolle spielt. @de
top concept of: Additional Terms (IT)

Theories
type: Collection
member: Holistic Psychology
preferred label: Theorien @de