Additional Terms (IT)
type: ConceptScheme
has top concept: Bioenergetics
preferred label: Zusatzdeskriptoren (IT) @de

Bioenergetics
type: Concept
alternative label: bioenergetic analysis
alternative label: bioenergetische Analyse @de
in scheme: Additional Terms (IT)
preferred label: Bioenergetik @de
scope note: Therapy founded by A. Lowen aimed at the integration of body, movement, breathing, emotions, and behavior. Also referred to as bioenergetic analysis.
scope note: Auch bioenergetische Analyse; ein Therapieverfahren nach A. Lowen, das darauf abzielt, den Einklang von Körper, Bewegung, Atmung, Gefühl und Verhalten herzustellen. @de
top concept of: Additional Terms (IT)

Clinical Psychology
type: Collection
member: Bioenergetics
preferred label: Klinische Psychologie @de