Additional Terms (IT)
type: ConceptScheme
has top concept: Audiovisual Self Confrontation
preferred label: Zusatzdeskriptoren (IT) @de

Audiovisual Self Confrontation
type: Concept
replaces: Self Confrontation
in scheme: Additional Terms (IT)
preferred label: Audiovisuelle Selbstkonfrontation @de
scope note: Usually video-assisted feedback on client behavior in psychotherapy, behavior training, and role-playing.
scope note: Über Videotechnologie und andere audiovisuelle Medien vermittelte Rückmeldung von Verhaltensweisen der therapierten Person in der Psychotherapie, dem Verhaltenstraining und in Rollenspielen. @de
top concept of: Additional Terms (IT)

Clinical Psychology
type: Collection
member: Audiovisual Self Confrontation
preferred label: Klinische Psychologie @de

Self Confrontation
type: Concept
preferred label: Selbstkonfrontation @de