Additional Terms (IT)
type: ConceptScheme
has top concept: Artifacts
preferred label: Zusatzdeskriptoren (IT) @de

Artifacts
type: Concept
in scheme: Additional Terms (IT)
preferred label: Artefakte @de
scope note: Errors or unforeseen influences in the research process which can lead to a misinterpretation of results.
scope note: Fehler oder unvorhergesehene Einflüsse im Forschungsprozess, die zu einer Fehlinterprationen von Untersuchungsergebnissen führen können. @de
top concept of: Additional Terms (IT)

Methodology
type: Collection
member: Artifacts
preferred label: Methodik @de